دهانه آتشفشان انفجاری
scope note: نوعی دهانه آتشفشانی که براثر انفجار در امتداد زون‌های کافتی مجاور آتشفشان‌های بزرگ پدید می‌آید
broader: دهانه آتشفشان
preferred label: explosion crater @en
type: Concept

دهانه آتشفشان
preferred label: crater @en
type: Concept
narrower: دهانه آتشفشان انفجاری