دوشکستی
preferred label: birefringence @en
type: Concept
narrower: دوشکستی مثبت

دوشکستی مثبت
scope note: نوعی دوشکستی که در آن سرعت باریکۀ عادی بیش از نور باریکۀ غیرعادی است
broader: دوشکستی
preferred label: positive birefringence @en
type: Concept