دگرگونی برخوردی
scope note: دگرگونی سنگ‌ها یا کانی‌ها براثر عبور یک موج ضربه‏ای ناشی از برخورد یک شهاب‏سنگ به سطح زمین
broader: دگرگونی
preferred label: impact metamorphism @en
type: Concept

دگرگونی
preferred label: metamorphism @en
type: Concept
narrower: دگرگونی برخوردی