پشته مدیترانه‌ای
scope note: در جنوب کرت و شمال سواحل شرق لیبی و غرب مصر امتداد دارد.
broader: دریای مدیترانه
preferred label: Mediterranean Ridge @en
type: Concept

دریای مدیترانه
preferred label: Mediterranean Sea @en
type: Concept
narrower: پشته مدیترانه‌ای