دریاچه زمین‏لغزه‏ای
scope note: دریاچه‏ای که براثر جمع شدن آب یک رود در پشت یک تودۀ زمین‏لغزه به وجود آمده است
broader: دریاچه
preferred label: landslide lake @en
type: Concept

دریاچه
preferred label: lake @en
type: Concept
narrower: دریاچه زمین‏لغزه‏ای