کالیفرنیا
preferred label: California @en
type: Concept
related: دره سالیناس

ناحیه مونتری کالیفرنیا
preferred label: Monterey County California @en
type: Concept
related: دره سالیناس

دره سالیناس
scope note: دره رودخانه‌ای در نواحی سان لوئیس اوپیسیپو و مونتری در غرب کالیفرنیا
related: ناحیه مونتری کالیفرنیا
related: کالیفرنیا
preferred label: Salinas Valley @en
type: Concept