داده‌ها
preferred label: data @en
type: Concept
related: داده‌های پراش نوترونی

تجزیه پراش نوترون
preferred label: neutron diffraction analysis @en
type: Concept
related: داده‌های پراش نوترونی

داده‌های پراش نوترونی
alternative label: داده‌های تجزیه پراش نوترونی
scope note: فقط برای داده‌ها استفاده می شود برای روش شناسی از واژه تجزیه با پراش نوترونی استفاده می شود.
related: داده‌ها
related: تجزیه پراش نوترون
preferred label: neutron diffraction data @en
type: Concept