خلیج سبز
scope note: خلیج کوچکی در شمال غرب دریاچه میشیگان در شمال شرق ویسکونزین و شمال غرب میشیگان. ممکن است در جاهای دیگری نیز واقع باشد.
related: میشیگان
related: ویسکونزین
preferred label: Green Bay @en
type: Concept

میشیگان
preferred label: Michigan @en
type: Concept
related: خلیج سبز

ویسکونزین
preferred label: Wisconsin @en
type: Concept
related: خلیج سبز