خلیج جاد
scope note: خلیج کوچکی در دریای شمال در ساحل شمال از ناحیه اولدنبورگ.
related: لاور ساکسونی آلمان
preferred label: Jade Bay @en
type: Concept

لاور ساکسونی آلمان
preferred label: Lower Saxony Germany @en
type: Concept
related: خلیج جاد