خط‌وارگی
preferred label: lineation @en
type: Concept
narrower: خطوارگی جریانی

خطوارگی جریانی
scope note: نوعی خطوارگی جدایی که در آن تیغه‌های خطی کوچک در فواصل چند میلی‌متری تا چند سانتیمتری از یکدیگر قرار گرفته‌اند
broader: خط‌وارگی
preferred label: current lineation @en
type: Concept