خزش
preferred label: creep @en
type: Concept
narrower: خاک‌خزش

خاک‌خزش
scope note: جریان روبه‌پایین آرام و تدریجی خاک و مواد سنگی ناپیوسته بر روی شیب ملایم یا تند
broader: خزش
preferred label: soil creep @en
type: Concept