خزش
preferred label: creep @en
type: Concept
narrower: خزش اولیه

خزش اولیه
scope note: مرحله آغازین کرنش کشسان که با حرکت روبه‌پایین منحنی واتنش زمان طولانی را شکل می‌دهد
broader: خزش
preferred label: primary creep @en
type: Concept