خزش سطحی
scope note: حرکت آهستۀ دانه‏های درشت در طول یک سطح براثر جهش دانه‏های کوچک‌تر
broader: خزش
preferred label: surface creep @en
type: Concept

خزش
preferred label: creep @en
type: Concept
narrower: خزش سطحی