جلبک آهکی
scope note: گروهی از جلبک‌ها که برای ساخت بدن خود از کلسیم‌کربنات موجود در آب کم عمق محل زندگیشان استفاده می‌کنند
related: آهکی
broader: جلبک‌ها
preferred label: calcareous algae @en
type: Concept

آهکی
preferred label: calcareous @en
type: Concept
related: جلبک آهکی

جلبک‌ها
preferred label: Algae @en
type: Concept
narrower: جلبک آهکی