خاک بازمانده
scope note: خاک تشکیل‌شده بر روی یک چشم‌انداز قدیمی که با رسوبات جوان‌تر پوشیده نشده است
broader: خاک
preferred label: relict soil @en
type: Concept

خاک
preferred label: soil @en
type: Concept
narrower: خاک بازمانده