خاک‏آهک
scope note: گروه بزرگی از خاک‌ها که در فرایند تشکیل آنها عنصر کلسیم انباشته شود
broader: خاک
preferred label: pedocal @en
type: Concept

خاک
preferred label: soil @en
type: Concept
narrower: خاک‏آهک