کانکتیکوت
preferred label: Connecticut @en
type: Concept
related: حوضه هارتفورد

ماساچوست
preferred label: Massachusetts @en
type: Concept
related: حوضه هارتفورد

حوضه هارتفورد
scope note: حوضه ریفتی تریاس تا ژوراسیک در مرکز کانکتیکوت و غرب ماساچوست.
related: ماساچوست
related: کانکتیکوت
preferred label: Hartford Basin @en
type: Concept