حوضه بادروبشی
scope note: تورفتگی عارضه‏نگاشتی که براثر بادروبش به وجود می‌آید
broader: حوضه
preferred label: deflation basin @en
type: Concept

حوضه
preferred label: basin @en
type: Concept
narrower: حوضه بادروبشی