حوضه
preferred label: basin @en
type: Concept
narrower: حوضه میان‏قاره‏ای

حوضه میان‏قاره‏ای
scope note: حوضه‏ای که بین دو قاره به‏ وجود آمده باشد
broader: حوضه
preferred label: intercontinental basin @en
type: Concept