حلقه دهانه آتشفشان
scope note: لبه حلقوی کم‌ارتفاعِ متشکل از مواد خردشده
related: دهانه آتشفشان
preferred label: crater ring @en
type: Concept

دهانه آتشفشان
preferred label: crater @en
type: Concept
related: حلقه دهانه آتشفشان