درزه
preferred label: joint @en
type: Concept
related: حفره درزه‏ای

حفره
preferred label: vesicle @en
type: Concept
related: حفره درزه‏ای

حفره درزه‏ای
scope note: حفره‏ای انحلالی که چگونگی گسترش آن را یک درزه تعیین می‌کند
related: حفره
related: درزه
preferred label: joint cavity @en
type: Concept