حبه فضله‌ای
alternative label: گندُلک پیخالی
scope note: ذره زیست‌شیمیایی کروی یا بیضوی یا میله‌ای به قطر کمتر از یک میلی‌متر که پیخال موجودات لجن‌خوار است
related: فسیل مدفوع
related: رسوب دریایی
preferred label: fecal pellet @en
type: Concept

فسیل مدفوع
preferred label: coprolite @en
type: Concept
related: حبه فضله‌ای

رسوب دریایی
preferred label: marine sediment @en
type: Concept
related: حبه فضله‌ای