حاشیه قاره‌ای
preferred label: continental margin @en
type: Concept
narrower: حاشیه قاره‏ای نافعال

حاشیه قاره‏ای نافعال
scope note: نوعی حاشیه قاره‏ای بدون فعالیت آتشفشانی و لرزه‏خیزی
broader: حاشیه قاره‌ای
preferred label: passive continental margin @en
type: Concept