چینه‌نگاری چرخه‌ای
scope note: مطالعۀ سنگ‌های چینه‌ای باتوجه‌به چرخه‌های تشکیل و تخریب آنها
related: چینه‌شناسی
preferred label: cyclostratigraphy @en
type: Concept

چینه‌شناسی
preferred label: stratigraphy @en
type: Concept
related: چینه‌نگاری چرخه‌ای