چینه‏بندی چلیپایی
preferred label: cross stratification @en
type: Concept
narrower: چینه‌بندی چلیپایی گُرده‌ای

چینه‌بندی چلیپایی گُرده‌ای
scope note: نوعی چینه‌بندی چلیپایی که در آن سطوح زیرین فرسایشی هستند و شیبی کمتر از 10 درجه دارند
broader: چینه‏بندی چلیپایی
preferred label: hummocky cross stratification (HCS) @en
type: Concept