چین برگشته
scope note: چینی که محور آن از حالت افقی نیز فراتر رفته است و به نظر می‏رسد توالی لایه‏ها در آن معکوس شده است
related: جهت‌گیری
broader: چین(ساختار زمین‌شناسی)
preferred label: overturned fold @en
type: Concept

جهت‌گیری
preferred label: orientation @en
type: Concept
related: چین برگشته

چین(ساختار زمین‌شناسی)
preferred label: fold @en
type: Concept
narrower: چین برگشته