چین(ساختار زمین‌شناسی)
preferred label: fold @en
type: Concept
narrower: چین بسته

چین بسته
scope note: چینی که زاویۀ بین یال‌های آن از 30 تا 70 درجه است.
broader: چین(ساختار زمین‌شناسی)
preferred label: close fold @en
type: Concept