چین بلمی
scope note: ناودیسی با چین‏خوردگی فشرده که نمای سطحی کشیده دارد
broader: چین(ساختار زمین‌شناسی)
preferred label: canoe fold @en
type: Concept

چین(ساختار زمین‌شناسی)
preferred label: fold @en
type: Concept
narrower: چین بلمی