چین خمشی
preferred label: flexure fold @en
type: Concept
narrower: چین خمشی‌ـ‌ جریانی

چین خمشی‌ـ‌ جریانی
scope note: نوعی چین خمشی که در آن چین‌خوردگی با جابه‌جایی موازی مرزهای لایه‌ای و شاره در درون لایه‌ها همراه است
broader: چین خمشی
preferred label: flexure-flow fold @en
type: Concept