چین متقارن
preferred label: symmetric fold @en
type: Concept
related: چین نامتقارن

چین(ساختار زمین‌شناسی)
preferred label: fold @en
type: Concept
narrower: چین نامتقارن

چین نامتقارن
scope note: چینی که یک یال آن در مقایسه با یال دیگر شیب تندتری دارد
related: چین متقارن
broader: چین(ساختار زمین‌شناسی)
preferred label: asymmetric fold @en
type: Concept