چین ناودیسی
scope note: چینی که در آن لایه‏های قدیمی‏تر در زیر لایه‏های جدیدتر تقعر پیدا می‏کنند
broader: چین(ساختار زمین‌شناسی)
preferred label: synclinal fold @en
type: Concept

چین(ساختار زمین‌شناسی)
preferred label: fold @en
type: Concept
narrower: چین ناودیسی