چوب
preferred label: wood @en
type: Concept
related: چوب سنگی‌شده

چوب سنگی‌شده
scope note: چوبی که براثر نفوذ آب‌های معدنی غالباً حاوی سیلیس به سنگ تبدیل شده است
related: چوب
preferred label: petrified wood @en
type: Concept