چندوجهی
preferred label: polyhedra @en
type: Concept
narrower: چهاروجهی

چهاروجهی
scope note: دیسۀ بلوری در بلورهای مکعبی با تقارن m و3 -4 یا 3 2
broader: چندوجهی
preferred label: tetrahedra @en
type: Concept