چندضلعی
preferred label: polygon @en
type: Concept
narrower: چندضلعی شکافه‏ای

چندضلعی شکافه‏ای
scope note: شکلی حاصل از به هم پیوستن شیارها یا شکافه‏ها که الگوی سطحی چندضلعی محدبی را به وجود می‌آورد
broader: چندضلعی
preferred label: fissure polygon @en
type: Concept