چندریختی
preferred label: polymorphism @en
type: Concept
narrower: چهارریختی

چهارریختی
scope note: نوعی چندریختی که در آن چهار شکل بلوری ایجاد می‌شود
broader: چندریختی
preferred label: tetramorphism @en
type: Concept