چرخه زمین‏ساختی
scope note: چرخه مربوط به نیروهای دخیل در زمین‏ساخت یا ساختارها و عوارض ناشی از این نیروها
related: چرخه
related: علم زمین‌ساخت
preferred label: tectonic cycle @en
type: Concept

چرخه
preferred label: cycle @en
type: Concept
related: چرخه زمین‏ساختی

علم زمین‌ساخت
preferred label: tectonics @en
type: Concept
related: چرخه زمین‏ساختی