چرخه
preferred label: cycle @en
type: Concept
related: چرخه رسوب‌گذاری

چرخه رسوب‌گذاری
scope note: توالی فرایندها و شرایط مرتبط با هم که در تشکیل یک نهشتۀ رسوبی تکرار می‌شود
related: چرخه
related: رسوب‌گذاری
preferred label: sedimentation cycle @en
type: Concept

رسوب‌گذاری
preferred label: sedimentation @en
type: Concept
related: چرخه رسوب‌گذاری