جلا
preferred label: luster @en
type: Concept
narrower: جلای ابریشمی

جلای ابریشمی
scope note: جلای ابریشم‏مانند کانی‌هایی که دارای ساختار رشته‏ای هستند
broader: جلا
preferred label: silky luster @en
type: Concept