جلا
preferred label: luster @en
type: Concept
narrower: جلای رزینی

جلای رزینی
scope note: جلای کانی‌هایی یا سنگ‌هایی که ظاهری شبیه به صمغ دارند
broader: جلا
preferred label: resinous luster @en
type: Concept