جلا
preferred label: luster @en
type: Concept
narrower: جلای صدفی

جلای صدفی
scope note: جلای کانی‌هایی که ظاهری شبیه به صدف مروارید دارند
broader: جلا
preferred label: pearly luster @en
type: Concept