جزایر اقیانوس هند
preferred label: Indian Ocean Islands @en
type: Concept
narrower: جزایر مالدیو

جزایر مالدیو
scope note: گروهی از 19 جزیره در اقیانوس هند، 300 مایلی نوک جنوب غربی هند.
broader: جزایر اقیانوس هند
preferred label: Maldive Islands @en
type: Concept