جزایر ماسکارن
preferred label: Mascarene Islands @en
type: Concept
related: موریتیوس

جزایر اقیانوس هند
preferred label: Indian Ocean Islands @en
type: Concept
narrower: موریتیوس

موریتیوس
scope note: ایالت مستقلی در جزایر ماسکارن حدود 450 مایلی شرق ماداگاسکار.
related: جزایر ماسکارن
broader: جزایر اقیانوس هند
preferred label: Mauritius @en
type: Concept