جزایر کرمادک
scope note: گروه جزایر آتشفشانی به طول 600 مایل در شمال و شمال غرب نیوزیلند.
related: گودال کرمادک
broader: جزایر اقیانوس آرام غربی
preferred label: Kermadec Islands @en
type: Concept

گودال کرمادک
preferred label: Kermadec Trench @en
type: Concept
related: جزایر کرمادک

جزایر اقیانوس آرام غربی
preferred label: West Pacific Ocean Islands @en
type: Concept
narrower: جزایر کرمادک