توده نفوذی
scope note: سنگ حاصل از جای‌گیری ماگما در سنگ‌های قدیمی‏تر
related: نفوذی
related: نفوذ
preferred label: intrusive mass @en
type: Concept

نفوذی
preferred label: intrusive @en
type: Concept
related: توده نفوذی

نفوذ
preferred label: intrusion @en
type: Concept
related: توده نفوذی