تلماسه سهموی
scope note: تلماسه بلند قاشقی‌شکل که سطح آن سهمی‌وار است
broader: تلماسه
preferred label: parabolic dune @en
type: Concept

تلماسه
preferred label: dune @en
type: Concept
narrower: تلماسه سهموی