ایرقیزیت
scope note: گروه تکتیت که با دهانه ژامانیشن در قزاقستان مشترک است.
related: قزاقستان
broader: تکتیت(شیشه طبیعی)
preferred label: irghizite @en
type: Concept

قزاقستان
preferred label: Kazakhstan @en
type: Concept
related: ایرقیزیت

تکتیت(شیشه طبیعی)
preferred label: tektite @en
type: Concept
narrower: ایرقیزیت