تفریق رسوبی
scope note: جدا شدن پیشروندۀ توده‌سنگ و تبدیل آن به محصولات متفاوت که به‌صورت رسوبات جورشده نهشته می‌شود
broader: تفریق
preferred label: sedimentary differentiation @en
type: Concept

تفریق
preferred label: differentiation @en
type: Concept
narrower: تفریق رسوبی