ترک‌خورده
preferred label: cracked @en
type: Concept
related: ترک کششی

ترک
preferred label: crack @en
type: Concept
narrower: ترک کششی

ترک کششی
scope note: نوعی ترک که براثر تنش کششی به‌ وجود آمده است
related: ترک‌خورده
broader: ترک
preferred label: tension crack @en
type: Concept