ترک ورقه‏ای
scope note: ترکی صفحه‏ای که براثر انقباض رسوب و آب‏زدایی به‌ وجود آمده است
broader: ترک
preferred label: sheet crack @en
type: Concept

ترک
preferred label: crack @en
type: Concept
narrower: ترک ورقه‏ای