تراوایی
preferred label: permeability @en
type: Concept
narrower: تراوایی مطلق

تراوایی مطلق
scope note: توانایی یک سنگ برای انتقال یک سیال در شرایط سیرشدگی صددرصد
broader: تراوایی
preferred label: absolute permeability @en
type: Concept